Org.apache.spark.sparkexception job aborted due to stage failure.

Thanks for contributing an answer to Stack Overflow! Please be sure to answer the question.Provide details and share your research! But avoid …. Asking for help, clarification, or responding to other answers.

Org.apache.spark.sparkexception job aborted due to stage failure. Things To Know About Org.apache.spark.sparkexception job aborted due to stage failure.

Sep 14, 2020 · Hi Team, I am writing a Delta file in ADL-Gen2 from ADF for multiple files dynamically using Dataflows activity. For the initial run i am able to read the file from Azure DataBricks . But when i rerun the pipeline with truncate and load i am getting… May 16, 2022 · Problem Databricks throws an error when fitting a SparkML model or Pipeline: org.apache.spark.SparkException: Job aborted due to stage failure: Task 0 in s Pyspark. spark.SparkException: Job aborted due to stage failure: Task 0 in stage 15.0 failed 1 times, java.net.SocketException: Connection reset Hot Network Questions Does America, like non-democratic countries like China, also have factions?Spark任务:Job aborted due to stage failure: Task 0 in stage 2.0 failed 4 times, most recent failure问题 跑Spark任务时报错,复制任务id(application_1111_222)到yarn页面中检索,发现报以下错误: Job aborted due to stage failure: Task 0 in stage 2.0 failed 4 times, most recent failure 使用sc读取

May 2, 2016 · Teams. Q&A for work. Connect and share knowledge within a single location that is structured and easy to search. Learn more about Teams @Tim, actually no I have set of operations like val source_primary_key = source.map(rec => (rec.split(",")(0), rec)) source_primary_key.persist(StorageLevel.DISK_ONLY) val extra_in_source = source_primary_key.subtractByKey(destination_primary_key) var pureextinsrc = extra_in_source.count() extra_in_source.cache()and so on but before this its throwing out of memory exception while im fetching ...

Feb 24, 2022 · Caused by: org.apache.spark.SparkException: Job aborted due to stage failure: Task 5 in stage 76.0 failed 4 times, most recent failure: Lost task 5.3 in stage 76.0 (TID 2334) (10.139.64.5 executor 6): com.databricks.sql.io.FileReadException: Error while reading file <File_Path> It is possible the underlying files have been updated. Mar 31, 2019 · org.apache.spark.SparkException: Job aborted due to stage failure: Task in stage failed,Lost task in stage : ExecutorLostFailure (executor 4 lost) Ask Question Asked 4 years, 5 months ago

Caused by: org.apache.spark.SparkException: Job aborted due to stage failure: Serialized task 2:0 was 155731289 bytes, which exceeds max allowed: spark.rpc.message.maxSize (134217728 bytes). Consider increasing spark.rpc.message.maxSize or using broadcast variables for large values.Jan 11, 2021 · SparkException: Job aborted due to stage failure: Task 58 in stage 13.0 failed 4 times, most recent failure: Lost task 58.3 in stage 13.0 (TID 488, 10.32.14.43, executor 4): java.lang.IllegalArgumentException: Illegal pattern character 'Q' Error: org.apache.spark.SparkException: Job aborted due to stage failure: Task 0 in stage 1985.0 failed 4 times, most recent failure: Lost task 0.3 in stage 1985.0 (TID 57569, 10.139.64.12, executor 15): com.microsoft.sqlserver.jdbc.SQLServerException: Conversion failed when converting the nvarchar value 'Aug' to data type int.Pyspark. spark.SparkException: Job aborted due to stage failure: Task 0 in stage 15.0 failed 1 times, java.net.SocketException: Connection reset Hot Network Questions Does America, like non-democratic countries like China, also have factions?

Solution 1. Check your environment variables. You are getting “py4j.protocol.Py4JError: org.apache.spark.api.python.PythonUtils.getEncryptionEnabled does not exist in the JVM” due to Spark environemnt variables are not set right.

org.apache.spark.shuffle.MetadataFetchFailedException: Missing an output location for shuffle 0 解决方法:这种问题一般发生在有大量shuffle操作的时候,task不断的failed,然后又重执行,一直循环下去,直到application失败。

May 11, 2022 · If absolutely necessary you can set the property spark.driver.maxResultSize to a value <X>g higher than the value reported in the exception message in the cluster Spark config ( AWS | Azure ): spark.driver.maxResultSize < X > g. The default value is 4g. For details, see Application Properties. If you set a high limit, out-of-memory errors can ... Mar 23, 2014 · FYI in Spark 2.4 a lot of you will probably encounter this issue. Kryo serialization has gotten better but in many cases you cannot use spark.kryo.unsafe=true or the naive kryo serializer. For a quick fix try changing the following in your Spark configuration spark.kryo.unsafe="false" OR. spark.serializer="org.apache.spark.serializer ... org.apache.spark.SparkException: Job aborted due to stage failure: Total size of serialized results of 69 tasks (4.0 GB) is bigger than spark.driver.maxResultSize (4.0 GB) 08-23-2021 07:48 AM. set spark.conf.set ("spark.driver.maxResultSize", "20g") get spark.conf.get ("spark.driver.maxResultSize") // 20g which is expected in notebook , I did ...Jun 25, 2020 · Apache Spark; koukou. ... org.apache.spark.SparkException: Job aborted due to stage failure: Task 0 in stage 30.0 failed 1 times, most recent failure: Lost task 0.0 ... May 11, 2022 · If absolutely necessary you can set the property spark.driver.maxResultSize to a value <X>g higher than the value reported in the exception message in the cluster Spark config ( AWS | Azure ): spark.driver.maxResultSize < X > g. The default value is 4g. For details, see Application Properties. If you set a high limit, out-of-memory errors can ... Here is the full list of commands creating the list, writing it to HDFS and finally printing out the results on the console using hdfs: spark-shell. After the shell has started you type: val nums = sc.parallelize (List (1,2,3,4,5)) nums.saveAsTextFile ("/tmp/simple_list") :quit. Now we read the data from HDFS (Hadoop File System):

Aug 23, 2021 · org.apache.spark.SparkException: Job aborted due to stage failure: Total size of serialized results of 69 tasks (4.0 GB) is bigger than spark.driver.maxResultSize (4.0 GB) 08-23-2021 07:48 AM. set spark.conf.set ("spark.driver.maxResultSize", "20g") get spark.conf.get ("spark.driver.maxResultSize") // 20g which is expected in notebook , I did ... Jan 10, 2020 · Teams. Q&A for work. Connect and share knowledge within a single location that is structured and easy to search. Learn more about Teams Jan 24, 2022 · 1 Answer. Sorted by: 1. You need to create an RDD of type RDD [Tuple [str]] but in your code, the line: rdd = spark.sparkContext.parallelize (comments) returns RDD [str] which then fails when you try to convert it to dataframe with that given schema. Try modifying that line to: Jul 7, 2019 · 1 I'm trying to use Linear Regression on a simple dataframe with one feature and one label using Python pyspark in Databricks. However, I'm running into some issues with stage failure. I've reviewed many similar problems, but most of them are in Scala or are out of the scope of what I'm doing here. Versions: Teams. Q&A for work. Connect and share knowledge within a single location that is structured and easy to search. Learn more about TeamsFeb 24, 2022 · Caused by: org.apache.spark.SparkException: Job aborted due to stage failure: Task 5 in stage 76.0 failed 4 times, most recent failure: Lost task 5.3 in stage 76.0 (TID 2334) (10.139.64.5 executor 6): com.databricks.sql.io.FileReadException: Error while reading file <File_Path> It is possible the underlying files have been updated.

Problem Databricks throws an error when fitting a SparkML model or Pipeline: org.apache.spark.SparkException: Job aborted due to stage failure: Task 0 in sTeams. Q&A for work. Connect and share knowledge within a single location that is structured and easy to search. Learn more about Teams

2 Answers. df.toPandas () collects all data to the driver node, hence it is very expensive operation. Also there is a spark property called maxResultSize. spark.driver.maxResultSize (default 1G) --> Limit of total size of serialized results of all partitions for each Spark action (e.g. collect) in bytes. Should be at least 1M, or 0 for unlimited.2 Answers. df.toPandas () collects all data to the driver node, hence it is very expensive operation. Also there is a spark property called maxResultSize. spark.driver.maxResultSize (default 1G) --> Limit of total size of serialized results of all partitions for each Spark action (e.g. collect) in bytes. Should be at least 1M, or 0 for unlimited.1 Answer. Sorted by: 1. You need to create an RDD of type RDD [Tuple [str]] but in your code, the line: rdd = spark.sparkContext.parallelize (comments) returns RDD [str] which then fails when you try to convert it to dataframe with that given schema. Try modifying that line to:May 2, 2016 · Teams. Q&A for work. Connect and share knowledge within a single location that is structured and easy to search. Learn more about Teams Feb 6, 2019 · I am new to PySpark. I have been writing my code with a test sample. Once I run the code on the larger file(3gb compressed). My code is only doing some filtering and joins. I keep getting errors May 2, 2016 · Teams. Q&A for work. Connect and share knowledge within a single location that is structured and easy to search. Learn more about Teams Nov 11, 2021 · 1 Answer. PySpark DF are lazy loading. When you call .show () you are asking the prior steps to execute and anyone of them may not work, you just can't see it until you call .show () because they haven't executed. I go back to earlier steps and call .collect () on each operation of the DF. This will at least allow you to isolate where the bad ... @Tim, actually no I have set of operations like val source_primary_key = source.map(rec => (rec.split(",")(0), rec)) source_primary_key.persist(StorageLevel.DISK_ONLY) val extra_in_source = source_primary_key.subtractByKey(destination_primary_key) var pureextinsrc = extra_in_source.count() extra_in_source.cache()and so on but before this its throwing out of memory exception while im fetching ...

I am running spark jobs using datafactory in azure databricks. My cluster vesion is 9.1 LTS ML (includes Apache Spark 3.1.2, Scala 2.12). I am writing data on azure blob storage. While writing job ...

Problem Databricks throws an error when fitting a SparkML model or Pipeline: org.apache.spark.SparkException: Job aborted due to stage failure: Task 0 in s

Mar 30, 2020 · org.apache.spark.SparkException: Job aborted due to stage failure: Task 29 in stage 0.0 failed 4 times, most recent failure: Lost task 29.3 in stage 0.0 (TID 92, 10.252.252.125, executor 23): ExecutorLostFailure (executor 23 exited caused by one of the running tasks) Reason: Remote RPC client disassociated. Caused by: org.apache.spark.SparkException: Job aborted due to stage failure: Total size of serialized results of 478 tasks (2026.0 MB) is bigger than spark.driver.maxResultSize (1024.0 MB) 当然可以通过调大spark.driver.maxResultSize的默认配置来解决问题,但如果不能从源头上解决小文件问题,以后还可能遇到 ...Spark任务:Job aborted due to stage failure: Task 0 in stage 2.0 failed 4 times, most recent failure问题 跑Spark任务时报错,复制任务id(application_1111_222)到yarn页面中检索,发现报以下错误: Job aborted due to stage failure: Task 0 in stage 2.0 failed 4 times, most recent failure 使用sc读取Jul 7, 2019 · 1 I'm trying to use Linear Regression on a simple dataframe with one feature and one label using Python pyspark in Databricks. However, I'm running into some issues with stage failure. I've reviewed many similar problems, but most of them are in Scala or are out of the scope of what I'm doing here. Versions: org.apache.spark.SparkException: Job aborted due to stage failure: Task 3 in stage 6.0 failed 1 times, most recent failure: Lost task 3.0 in stage 6.0 (TID 62, LAPTOP-H7MM9952, executor driver): org.apache.spark.SparkException: Task failed while writing rows.不知道是什么原因。. (利用 Spark-submit 提交 参数都正常). 但是 集群上的版本是1.5,和2.0都无法跑出来结果,但是1.3就能出结果, 所以目前确定是 Spark 1.5以上的版本对协同过滤算法不兼容引起,具体原因不详。. task倾斜原因比较多,网络io,cpu,mem都有可能造成 ... org.apache.spark.shuffle.MetadataFetchFailedException: Missing an output location for shuffle 0 解决方法:这种问题一般发生在有大量shuffle操作的时候,task不断的failed,然后又重执行,一直循环下去,直到application失败。hello everyone I am working on PySpark Python and I have mentioned the code and getting some issue, I am wondering if someone knows about the following issue? windowSpec = Window.partitionBy(df['id']).orderBy(df_Broadcast['id']) windowSp...Exception in thread "main" org.apache.spark.SparkException : Job aborted due to stage failure: Task 3 in stage 0.0 failed 4 times, most recent failure: Lost task 3.3 in stage 0.0 (TID 14, 192.168.10.38): ExecutorLostFailure (executor 3 lost) Driver stacktrace:Jan 10, 2020 · Teams. Q&A for work. Connect and share knowledge within a single location that is structured and easy to search. Learn more about Teams

org.apache.spark.SparkException: Job aborted due to stage failure: Task 3 in stage 6.0 failed 1 times, most recent failure: Lost task 3.0 in stage 6.0 (TID 62, LAPTOP-H7MM9952, executor driver): org.apache.spark.SparkException: Task failed while writing rows.Oct 6, 2017 · @Tim, actually no I have set of operations like val source_primary_key = source.map(rec => (rec.split(",")(0), rec)) source_primary_key.persist(StorageLevel.DISK_ONLY) val extra_in_source = source_primary_key.subtractByKey(destination_primary_key) var pureextinsrc = extra_in_source.count() extra_in_source.cache()and so on but before this its throwing out of memory exception while im fetching ... Apr 9, 2021 · Viewed 8k times. 1. I am trying to do some computation using UDFs. But after the computation when i try to convert the pyspark dataframe to pandas it gives me org.apache.spark.SparkException: Exception thrown in awaitResult: I will put down the reproducible code. import pandas as pd import numpy as np import time n = 10000 sample_df = pd ... Teams. Q&A for work. Connect and share knowledge within a single location that is structured and easy to search. Learn more about TeamsInstagram:https://instagram. activate amazon corpwww.basketball reference.comup and down words answers today hoyt855 795 0509 Exception in thread "main" org.apache.spark.SparkException : Job aborted due to stage failure: Task 3 in stage 0.0 failed 4 times, most recent failure: Lost task 3.3 in stage 0.0 (TID 14, 192.168.10.38): ExecutorLostFailure (executor 3 lost) Driver stacktrace:Aug 9, 2021 · You need to change this parameter in the cluster configuration. Go into the cluster settings, under Advanced select spark and paste spark.driver.maxResultSize 0 (for unlimited) or whatever the value suits you. Using 0 is not recommended. You should optimize the job by re partitioning. See the links below for more information: https://docs ... monetdenizbank doviz kurlari May 11, 2022 · If absolutely necessary you can set the property spark.driver.maxResultSize to a value <X>g higher than the value reported in the exception message in the cluster Spark config ( AWS | Azure ): spark.driver.maxResultSize < X > g. The default value is 4g. For details, see Application Properties. If you set a high limit, out-of-memory errors can ... May 11, 2022 · If absolutely necessary you can set the property spark.driver.maxResultSize to a value <X>g higher than the value reported in the exception message in the cluster Spark config ( AWS | Azure ): spark.driver.maxResultSize < X > g. The default value is 4g. For details, see Application Properties. If you set a high limit, out-of-memory errors can ... wasp injection knife Sep 1, 2022 · use dbr version : 10.4 LTS (includes Apache Spark 3.2.1, Scala 2.12) for spark configuartion edit the spark tab by editing the cluster and use below code there. "spark.sql.ansi.enabled false" Teams. Q&A for work. Connect and share knowledge within a single location that is structured and easy to search. Learn more about Teams1 Answer. Sorted by: 1. You need to create an RDD of type RDD [Tuple [str]] but in your code, the line: rdd = spark.sparkContext.parallelize (comments) returns RDD [str] which then fails when you try to convert it to dataframe with that given schema. Try modifying that line to: